{"text_format":"1","workbook":"xlsx","n_sheets":6,"sheets":["Revision History","Cover","Control_Panel","Data for submission ","Validation and Data Checks","Backsheet"],"not_rendered":{"charts":0,"images":1,"macros":0,"external_links":1,"defined_names":39,"comments":0,"pivot_tables":0},"unopened":[],"bounds":{"document_bytes":16777216,"sheet_cells":100000,"rows_first":2000,"rows_last":500,"rows_between":2000,"halvings":0,"cell_chars":16384,"cell_head_chars":4096},"cells_cut":0,"cells_raw":0,"read":"whole","date_system":"1900"}

{"sheet":"Revision History","index":0,"n_rows":12,"n_cols":4,"rows_kept":12,"cut":false,"hidden":true,"merged":[]}
[]
[null,"Revision History "]
[null,null,"WRES2"]
[null,"Version","Date","Change "]
[null,1,"2019-04-03","Changed dates - Owen Chinembiri"]
[null,2,"2019-06-06","Updated Template - MM"]
[null,3,"2019-06-12","Backsheet Added - AB"]
[null,3.1,"2019-06-13","Sheets locked down and upversioned for SharePoint and SDCS - RL"]
[null,4,"2019-06-14","Upversioned and error message made visible - RL"]
[null,5,"2019-06-17","Autocalculation formulae added back in from Mo's template - RL"]
[null,5.0999999999999996,"2019-07-01","Edited validation formula on Control Panel to check for right amount of cells - RL"]
[null,6,"2019-07-10","Updated Cells"]

{"sheet":"Cover","index":1,"n_rows":9,"n_cols":5,"rows_kept":9,"cut":false,"hidden":false,"merged":[[15,3,15,5],[7,5,7,6],[8,2,8,3],[8,4,8,5],[12,3,12,4],[14,3,14,5],[5,2,5,3],[5,4,6,4],[5,5,6,6],[1,1,2,12],[3,1,3,12]]}
[]
[null,"Workforce Race Equality \nStandards annual collection "]
[]
[null," as at March-2019"]
[]
[]
[]
[]
[null,null,"Period:",null,"April 2016-17"]

{"sheet":"Control_Panel","index":2,"n_rows":11,"n_cols":12,"rows_kept":11,"cut":false,"hidden":false,"merged":[[9,1,9,7],[10,1,10,7],[1,1,1,7],[3,1,3,7],[4,1,6,7],[8,1,8,7]]}
[null,null,null,null,null,null,null,null,null,null,"Backsheet check"]
[null,"Workforce Race Equality Standards",null,null,null,null,null,null,null,null,{"$f":"IF(SUM(IF(ISERROR(INDIRECT(\"Backsheet!\" &L2)),1,0))=0,0,1)","v":0},"A2:ZZ500"]
[]
[null,"Validations"]
[null,"Please correct all issues listed within the table below. If the issues are not corrected then the pro forma will fail the validation stage in SDCS. "]
[]
[]
[]
[null,"Trust - Frontsheet"]
[null,{"$f":"IF(COUNTA(answer_cells)<>550,\"Please complete all yellow answer cells on the 'Data for submission' tab. The 'Validation and Data Checks' tab can be used to identify which cells still need to be answered.\",\"\")","v":""},null,null,null,null,null,null,null,{"$f":"B10","v":""}]
[null,{"$f":"IF(SUM(COUNTIF(INDIRECT({\"'Data for submission '!$G$73\",\"'Data for submission '!$G$69:$G$70\",\"'Data for submission '!$I$69:$I$70\",\"'Data for submission '!$I$73\",\"'Data for submission '!$K$73\",\"'Data for submission '!$K$69:$K$70\",\"'Data for submission '!$M$69:$M$70\",\"'Data for submission '!$M$73\",\"'Data for submission '!$O$69:$O$70\",\"'Data for submission '!$O$73\",\"'Data for submission '!$Q$69:$Q$70\",\"'Data for submission '!$Q$73\",\"'Data for submission '!$Q$62\",\"'Data for submission '!$O$62\",\"'Data for submission '!$M$62\",\"'Data for submission '!$Q$58\",\"'Data for submission '!$O$58\",\"'Data for submission '!$M$58\",\"'Data for submission '!$G$48:$G$52\",\"'Data for submission '!$I$48:$I$54\",\"'Data for submission '!$K$48:$K$54\",\"'Data for submission '!$M$48:$M$54\",\"'Data for submission '!$O$48:$O$54\",\"'Data for submission '!$Q$48:$Q$54\",\"'Data for submission '!$Q$38:$Q$46\",\"'Data for submission '!$O$33:$O$46\",\"'Data for submission '!$Q$33:$Q$37\",\"'Data for submission '!$M$33:$M$46\",\"'Data for submission '!$K$33:$K$46\",\"'Data for submission '!$I$33:$I$46\",\"'Data for submission '!$G$33:$G$46\",\"'Data for submission '!$G$17:$G$30\",\"'Data for submission '!$I$17:$I$30\",\"'Data for submission '!$K$17:$K$29\",\"'Data for submission '!$K$30\",\"'Data for submission '!$M$17:$M$30\",\"'Data for submission '!$O$17:$O$30\",\"'Data for submission '!$Q$17:$Q$30\"}),\"*\"))>0,\"Answer cells cannot contain text.\",\"\")","v":""},null,null,null,null,null,null,null,{"$f":"B11","v":""}]

{"sheet":"Data for submission ","index":3,"n_rows":82,"n_cols":24,"rows_kept":82,"cut":false,"hidden":false,"merged":[[68,0,81,0],[13,0,14,1],[13,4,14,4],[60,0,63,0],[68,1,81,1],[13,17,14,17],[52,0,55,0],[15,0,51,0],[56,0,59,0],[13,15,14,16],[13,13,14,14],[13,7,14,8],[13,5,14,6],[13,9,14,10],[13,2,14,2],[30,17,31,17],[46,11,46,16],[46,3,46,4],[8,2,8,4],[12,5,12,10],[13,11,14,12],[60,1,63,1],[56,1,59,1],[52,1,55,1],[15,1,51,1],[30,2,31,2],[30,3,31,4],[13,3,14,3],[30,5,31,10],[46,5,46,10],[30,11,31,16],[12,11,12,16]]}
[]
[]
[null,"SubmissionTemplate"]
[]
[null,"Workforce Race Equality Standards 2018/19 template"]
[]
[]
[]
[null,null,null,null,null,null,"Answer Required"]
[null,null,null,null,null,null,"Auto Populated"]
[null,null,null,null,null,null,"N/A"]
[]
[null,null,null,null,null,"31st MARCH 2018",null,null,null,null,null,"31st MARCH 2019"]
["INDICATOR",null,"DATA ITEM",null,"MEASURE","WHITE",null,"BME",null,"ETHNICITY UNKNOWN/NULL",null,"WHITE",null,"BME",null,"ETHNICITY UNKNOWN/NULL",null,"Notes"]
[]
{"$rows_left_out":68}
{"sheet":"Validation and Data Checks","index":4,"n_rows":83,"n_cols":24,"rows_kept":83,"cut":false,"hidden":false,"merged":[[69,0,82,0],[13,13,14,14],[53,0,56,0],[53,1,56,1],[57,0,60,0],[57,1,60,1],[61,0,64,0],[61,1,64,1],[13,11,14,12],[16,0,52,0],[16,1,52,1],[13,0,14,1],[13,4,14,4],[13,5,14,6],[8,2,8,3],[12,5,12,10],[12,11,12,16],[13,15,14,16],[13,17,14,17],[13,7,14,8],[13,9,14,10]]}
[]
[]
[null,"SubmissionTemplate"]
[]
[null,"Workforce Race Equality Standards 2018/19 template"]
[]
[]
[]
[]
[null,null,null,null,null,null,{"$f":"IF(G8>0,\"There are errors. Please ensure all questions are answered\",\"\")","v":""}]
[]
[]
[null,null,null,null,null,"31st MARCH 2018",null,null,null,null,null,"31st MARCH 2019"]
["INDICATOR",null,null,null,"MEASURE","WHITE",null,"BME",null,"ETHNICITY UNKNOWN/NULL",null,"WHITE",null,"BME",null,"ETHNICITY UNKNOWN/NULL",null,"Notes"]
[null,null,"DATA ITEM"]
{"$rows_left_out":69}
{"sheet":"Backsheet","index":5,"n_rows":64,"n_cols":15,"rows_kept":64,"cut":false,"hidden":true,"merged":[]}
["Data Item:N","LOOKUP_REF","ESRFiguresWhitePreviousYear:N","VerifiedFiguresWhitePreviousYear:N","ESRFiguresBMEPreviousYear:N","VerifiedFiguresBMEPreviousYear:N","ESRFiguresUnknownPreviousYear:N","VerifiedFiguresUnknownPreviousYear:N","ESRFiguresWhiteCurrentYear:N","VerifiedFiguresWhiteCurrentYear:N","ESRFiguresBMECurrentYear:N","VerifiedFiguresBMECurrentYear:N","ESRFiguresUnknownCurrentYear:N","VerifiedFiguresUnknownCurrentYear:N","WrcComments"]
[1,"Ind1_NC_Under Band 1",{"$f":"IF('Data for submission '!F17=\"\",0,'Data for submission '!F17)","v":6},{"$f":"IF('Data for submission '!G17=\"\",0,'Data for submission '!G17)","v":6},{"$f":"IF('Data for submission '!H17=\"\",0,'Data for submission '!H17)","v":32},{"$f":"IF('Data for submission '!I17=\"\",0,'Data for submission '!I17)","v":31},{"$f":"IF('Data for submission '!J17=\"\",0,'Data for submission '!J17)","v":0},{"$f":"IF('Data for submission '!K17=\"\",0,'Data for submission '!K17)","v":0},{"$f":"IF('Data for submission '!L17=\"\",0,'Data for submission '!L17)","v":7},{"$f":"IF('Data for submission '!M17=\"\",0,'Data for submission '!M17)","v":7},{"$f":"IF('Data for submission '!N17=\"\",0,'Data for submission '!N17)","v":31},{"$f":"IF('Data for submission '!O17=\"\",0,'Data for submission '!O17)","v":31},{"$f":"IF('Data for submission '!P17=\"\",0,'Data for submission '!P17)","v":1},{"$f":"IF('Data for submission '!Q17=\"\",0,'Data for submission '!Q17)","v":1},{"$f":"IF(ISBLANK('Data for submission '!R17),\"\",'Data for submission '!R17)","v":""}]
[2,"Ind1_NC_Band 1",{"$f":"IF('Data for submission '!F18=\"\",0,'Data for submission '!F18)","v":0},{"$f":"IF('Data for submission '!G18=\"\",0,'Data for submission '!G18)","v":0},{"$f":"IF('Data for submission '!H18=\"\",0,'Data for submission '!H18)","v":0},{"$f":"IF('Data for submission '!I18=\"\",0,'Data for submission '!I18)","v":0},{"$f":"IF('Data for submission '!J18=\"\",0,'Data for submission '!J18)","v":0},{"$f":"IF('Data for submission '!K18=\"\",0,'Data for submission '!K18)","v":0},{"$f":"IF('Data for submission '!L18=\"\",0,'Data for submission '!L18)","v":0},{"$f":"IF('Data for submission '!M18=\"\",0,'Data for submission '!M18)","v":0},{"$f":"IF('Data for submission '!N18=\"\",0,'Data for submission '!N18)","v":0},{"$f":"IF('Data for submission '!O18=\"\",0,'Data for submission '!O18)","v":0},{"$f":"IF('Data for submission '!P18=\"\",0,'Data for submission '!P18)","v":0},{"$f":"IF('Data for submission '!Q18=\"\",0,'Data for submission '!Q18)","v":0},{"$f":"IF(ISBLANK('Data for submission '!R18),\"\",'Data for submission '!R18)","v":""}]
[3,"Ind1_NC_Band 2",{"$f":"IF('Data for submission '!F19=\"\",0,'Data for submission '!F19)","v":2},{"$f":"IF('Data for submission '!G19=\"\",0,'Data for submission '!G19)","v":2},{"$f":"IF('Data for submission '!H19=\"\",0,'Data for submission '!H19)","v":5},{"$f":"IF('Data for submission '!I19=\"\",0,'Data for submission '!I19)","v":5},{"$f":"IF('Data for submission '!J19=\"\",0,'Data for submission '!J19)","v":0},{"$f":"IF('Data for submission '!K19=\"\",0,'Data for submission '!K19)","v":0},{"$f":"IF('Data for submission '!L19=\"\",0,'Data for submission '!L19)","v":29},{"$f":"IF('Data for submission '!M19=\"\",0,'Data for submission '!M19)","v":29},{"$f":"IF('Data for submission '!N19=\"\",0,'Data for submission '!N19)","v":5},{"$f":"IF('Data for submission '!O19=\"\",0,'Data for submission '!O19)","v":5},{"$f":"IF('Data for submission '!P19=\"\",0,'Data for submission '!P19)","v":0},{"$f":"IF('Data for submission '!Q19=\"\",0,'Data for submission '!Q19)","v":0},{"$f":"IF(ISBLANK('Data for submission '!R19),\"\",'Data for submission '!R19)","v":""}]
[4,"Ind1_NC_Band 3",{"$f":"IF('Data for submission '!F20=\"\",0,'Data for submission '!F20)","v":65},{"$f":"IF('Data for submission '!G20=\"\",0,'Data for submission '!G20)","v":64},{"$f":"IF('Data for submission '!H20=\"\",0,'Data for submission '!H20)","v":98},{"$f":"IF('Data for submission '!I20=\"\",0,'Data for submission '!I20)","v":98},{"$f":"IF('Data for submission '!J20=\"\",0,'Data for submission '!J20)","v":2},{"$f":"IF('Data for submission '!K20=\"\",0,'Data for submission '!K20)","v":2},{"$f":"IF('Data for submission '!L20=\"\",0,'Data for submission '!L20)","v":94},{"$f":"IF('Data for submission '!M20=\"\",0,'Data for submission '!M20)","v":94},{"$f":"IF('Data for submission '!N20=\"\",0,'Data for submission '!N20)","v":116},{"$f":"IF('Data for submission '!O20=\"\",0,'Data for submission '!O20)","v":116},{"$f":"IF('Data for submission '!P20=\"\",0,'Data for submission '!P20)","v":4},{"$f":"IF('Data for submission '!Q20=\"\",0,'Data for submission '!Q20)","v":4},{"$f":"IF(ISBLANK('Data for submission '!R20),\"\",'Data for submission '!R20)","v":""}]
[5,"Ind1_NC_Band 4",{"$f":"IF('Data for submission '!F21=\"\",0,'Data for submission '!F21)","v":134},{"$f":"IF('Data for submission '!G21=\"\",0,'Data for submission '!G21)","v":134},{"$f":"IF('Data for submission '!H21=\"\",0,'Data for submission '!H21)","v":196},{"$f":"IF('Data for submission '!I21=\"\",0,'Data for submission '!I21)","v":194},{"$f":"IF('Data for submission '!J21=\"\",0,'Data for submission '!J21)","v":12},{"$f":"IF('Data for submission '!K21=\"\",0,'Data for submission '!K21)","v":12},{"$f":"IF('Data for submission '!L21=\"\",0,'Data for submission '!L21)","v":137},{"$f":"IF('Data for submission '!M21=\"\",0,'Data for submission '!M21)","v":137},{"$f":"IF('Data for submission '!N21=\"\",0,'Data for submission '!N21)","v":187},{"$f":"IF('Data for submission '!O21=\"\",0,'Data for submission '!O21)","v":187},{"$f":"IF('Data for submission '!P21=\"\",0,'Data for submission '!P21)","v":16},{"$f":"IF('Data for submission '!Q21=\"\",0,'Data for submission '!Q21)","v":16},{"$f":"IF(ISBLANK('Data for submission '!R21),\"\",'Data for submission '!R21)","v":""}]
[6,"Ind1_NC_Band 5",{"$f":"IF('Data for submission '!F22=\"\",0,'Data for submission '!F22)","v":81},{"$f":"IF('Data for submission '!G22=\"\",0,'Data for submission '!G22)","v":81},{"$f":"IF('Data for submission '!H22=\"\",0,'Data for submission '!H22)","v":91},{"$f":"IF('Data for submission '!I22=\"\",0,'Data for submission '!I22)","v":90},{"$f":"IF('Data for submission '!J22=\"\",0,'Data for submission '!J22)","v":5},{"$f":"IF('Data for submission '!K22=\"\",0,'Data for submission '!K22)","v":5},{"$f":"IF('Data for submission '!L22=\"\",0,'Data for submission '!L22)","v":91},{"$f":"IF('Data for submission '!M22=\"\",0,'Data for submission '!M22)","v":91},{"$f":"IF('Data for submission '!N22=\"\",0,'Data for submission '!N22)","v":110},{"$f":"IF('Data for submission '!O22=\"\",0,'Data for submission '!O22)","v":110},{"$f":"IF('Data for submission '!P22=\"\",0,'Data for submission '!P22)","v":8},{"$f":"IF('Data for submission '!Q22=\"\",0,'Data for submission '!Q22)","v":8},{"$f":"IF(ISBLANK('Data for submission '!R22),\"\",'Data for submission '!R22)","v":""}]
[7,"Ind1_NC_Band 6",{"$f":"IF('Data for submission '!F23=\"\",0,'Data for submission '!F23)","v":58},{"$f":"IF('Data for submission '!G23=\"\",0,'Data for submission '!G23)","v":57},{"$f":"IF('Data for submission '!H23=\"\",0,'Data for submission '!H23)","v":64},{"$f":"IF('Data for submission '!I23=\"\",0,'Data for submission '!I23)","v":64},{"$f":"IF('Data for submission '!J23=\"\",0,'Data for submission '!J23)","v":3},{"$f":"IF('Data for submission '!K23=\"\",0,'Data for submission '!K23)","v":3},{"$f":"IF('Data for submission '!L23=\"\",0,'Data for submission '!L23)","v":69},{"$f":"IF('Data for submission '!M23=\"\",0,'Data for submission '!M23)","v":69},{"$f":"IF('Data for submission '!N23=\"\",0,'Data for submission '!N23)","v":65},{"$f":"IF('Data for submission '!O23=\"\",0,'Data for submission '!O23)","v":65},{"$f":"IF('Data for submission '!P23=\"\",0,'Data for submission '!P23)","v":7},{"$f":"IF('Data for submission '!Q23=\"\",0,'Data for submission '!Q23)","v":7},{"$f":"IF(ISBLANK('Data for submission '!R23),\"\",'Data for submission '!R23)","v":""}]
[8,"Ind1_NC_Band 7",{"$f":"IF('Data for submission '!F24=\"\",0,'Data for submission '!F24)","v":48},{"$f":"IF('Data for submission '!G24=\"\",0,'Data for submission '!G24)","v":49},{"$f":"IF('Data for submission '!H24=\"\",0,'Data for submission '!H24)","v":31},{"$f":"IF('Data for submission '!I24=\"\",0,'Data for submission '!I24)","v":30},{"$f":"IF('Data for submission '!J24=\"\",0,'Data for submission '!J24)","v":0},{"$f":"IF('Data for submission '!K24=\"\",0,'Data for submission '!K24)","v":0},{"$f":"IF('Data for submission '!L24=\"\",0,'Data for submission '!L24)","v":47},{"$f":"IF('Data for submission '!M24=\"\",0,'Data for submission '!M24)","v":47},{"$f":"IF('Data for submission '!N24=\"\",0,'Data for submission '!N24)","v":30},{"$f":"IF('Data for submission '!O24=\"\",0,'Data for submission '!O24)","v":30},{"$f":"IF('Data for submission '!P24=\"\",0,'Data for submission '!P24)","v":3},{"$f":"IF('Data for submission '!Q24=\"\",0,'Data for submission '!Q24)","v":3},{"$f":"IF(ISBLANK('Data for submission '!R24),\"\",'Data for submission '!R24)","v":""}]
[9,"Ind1_NC_Band 8A",{"$f":"IF('Data for submission '!F25=\"\",0,'Data for submission '!F25)","v":53},{"$f":"IF('Data for submission '!G25=\"\",0,'Data for submission '!G25)","v":51},{"$f":"IF('Data for submission '!H25=\"\",0,'Data for submission '!H25)","v":28},{"$f":"IF('Data for submission '!I25=\"\",0,'Data for submission '!I25)","v":29},{"$f":"IF('Data for submission '!J25=\"\",0,'Data for submission '!J25)","v":1},{"$f":"IF('Data for submission '!K25=\"\",0,'Data for submission '!K25)","v":1},{"$f":"IF('Data for submission '!L25=\"\",0,'Data for submission '!L25)","v":51},{"$f":"IF('Data for submission '!M25=\"\",0,'Data for submission '!M25)","v":51},{"$f":"IF('Data for submission '!N25=\"\",0,'Data for submission '!N25)","v":40},{"$f":"IF('Data for submission '!O25=\"\",0,'Data for submission '!O25)","v":40},{"$f":"IF('Data for submission '!P25=\"\",0,'Data for submission '!P25)","v":4},{"$f":"IF('Data for submission '!Q25=\"\",0,'Data for submission '!Q25)","v":4},{"$f":"IF(ISBLANK('Data for submission '!R25),\"\",'Data for submission '!R25)","v":""}]
[10,"Ind1_NC_Band 8B",{"$f":"IF('Data for submission '!F26=\"\",0,'Data for submission '!F26)","v":31},{"$f":"IF('Data for submission '!G26=\"\",0,'Data for submission '!G26)","v":31},{"$f":"IF('Data for submission '!H26=\"\",0,'Data for submission '!H26)","v":5},{"$f":"IF('Data for submission '!I26=\"\",0,'Data for submission '!I26)","v":5},{"$f":"IF('Data for submission '!J26=\"\",0,'Data for submission '!J26)","v":0},{"$f":"IF('Data for submission '!K26=\"\",0,'Data for submission '!K26)","v":0},{"$f":"IF('Data for submission '!L26=\"\",0,'Data for submission '!L26)","v":23},{"$f":"IF('Data for submission '!M26=\"\",0,'Data for submission '!M26)","v":23},{"$f":"IF('Data for submission '!N26=\"\",0,'Data for submission '!N26)","v":8},{"$f":"IF('Data for submission '!O26=\"\",0,'Data for submission '!O26)","v":8},{"$f":"IF('Data for submission '!P26=\"\",0,'Data for submission '!P26)","v":0},{"$f":"IF('Data for submission '!Q26=\"\",0,'Data for submission '!Q26)","v":0},{"$f":"IF(ISBLANK('Data for submission '!R26),\"\",'Data for submission '!R26)","v":""}]
[11,"Ind1_NC_Band 8C",{"$f":"IF('Data for submission '!F27=\"\",0,'Data for submission '!F27)","v":19},{"$f":"IF('Data for submission '!G27=\"\",0,'Data for submission '!G27)","v":19},{"$f":"IF('Data for submission '!H27=\"\",0,'Data for submission '!H27)","v":6},{"$f":"IF('Data for submission '!I27=\"\",0,'Data for submission '!I27)","v":6},{"$f":"IF('Data for submission '!J27=\"\",0,'Data for submission '!J27)","v":0},{"$f":"IF('Data for submission '!K27=\"\",0,'Data for submission '!K27)","v":0},{"$f":"IF('Data for submission '!L27=\"\",0,'Data for submission '!L27)","v":23},{"$f":"IF('Data for submission '!M27=\"\",0,'Data for submission '!M27)","v":23},{"$f":"IF('Data for submission '!N27=\"\",0,'Data for submission '!N27)","v":6},{"$f":"IF('Data for submission '!O27=\"\",0,'Data for submission '!O27)","v":6},{"$f":"IF('Data for submission '!P27=\"\",0,'Data for submission '!P27)","v":0},{"$f":"IF('Data for submission '!Q27=\"\",0,'Data for submission '!Q27)","v":0},{"$f":"IF(ISBLANK('Data for submission '!R27),\"\",'Data for submission '!R27)","v":""}]
[12,"Ind1_NC_Band 8D",{"$f":"IF('Data for submission '!F28=\"\",0,'Data for submission '!F28)","v":15},{"$f":"IF('Data for submission '!G28=\"\",0,'Data for submission '!G28)","v":16},{"$f":"IF('Data for submission '!H28=\"\",0,'Data for submission '!H28)","v":0},{"$f":"IF('Data for submission '!I28=\"\",0,'Data for submission '!I28)","v":0},{"$f":"IF('Data for submission '!J28=\"\",0,'Data for submission '!J28)","v":0},{"$f":"IF('Data for submission '!K28=\"\",0,'Data for submission '!K28)","v":0},{"$f":"IF('Data for submission '!L28=\"\",0,'Data for submission '!L28)","v":22},{"$f":"IF('Data for submission '!M28=\"\",0,'Data for submission '!M28)","v":22},{"$f":"IF('Data for submission '!N28=\"\",0,'Data for submission '!N28)","v":2},{"$f":"IF('Data for submission '!O28=\"\",0,'Data for submission '!O28)","v":2},{"$f":"IF('Data for submission '!P28=\"\",0,'Data for submission '!P28)","v":0},{"$f":"IF('Data for submission '!Q28=\"\",0,'Data for submission '!Q28)","v":0},{"$f":"IF(ISBLANK('Data for submission '!R28),\"\",'Data for submission '!R28)","v":""}]
[13,"Ind1_NC_Band 9",{"$f":"IF('Data for submission '!F29=\"\",0,'Data for submission '!F29)","v":4},{"$f":"IF('Data for submission '!G29=\"\",0,'Data for submission '!G29)","v":6},{"$f":"IF('Data for submission '!H29=\"\",0,'Data for submission '!H29)","v":0},{"$f":"IF('Data for submission '!I29=\"\",0,'Data for submission '!I29)","v":2},{"$f":"IF('Data for submission '!J29=\"\",0,'Data for submission '!J29)","v":0},{"$f":"IF('Data for submission '!K29=\"\",0,'Data for submission '!K29)","v":0},{"$f":"IF('Data for submission '!L29=\"\",0,'Data for submission '!L29)","v":7},{"$f":"IF('Data for submission '!M29=\"\",0,'Data for submission '!M29)","v":7},{"$f":"IF('Data for submission '!N29=\"\",0,'Data for submission '!N29)","v":2},{"$f":"IF('Data for submission '!O29=\"\",0,'Data for submission '!O29)","v":2},{"$f":"IF('Data for submission '!P29=\"\",0,'Data for submission '!P29)","v":0},{"$f":"IF('Data for submission '!Q29=\"\",0,'Data for submission '!Q29)","v":0},{"$f":"IF(ISBLANK('Data for submission '!R29),\"\",'Data for submission '!R29)","v":""}]
[14,"Ind1_NC_VSM",{"$f":"IF('Data for submission '!F30=\"\",0,'Data for submission '!F30)","v":7},{"$f":"IF('Data for submission '!G30=\"\",0,'Data for submission '!G30)","v":5},{"$f":"IF('Data for submission '!H30=\"\",0,'Data for submission '!H30)","v":5},{"$f":"IF('Data for submission '!I30=\"\",0,'Data for submission '!I30)","v":4},{"$f":"IF('Data for submission '!J30=\"\",0,'Data for submission '!J30)","v":0},{"$f":"IF('Data for submission '!K30=\"\",0,'Data for submission '!K30)","v":0},{"$f":"IF('Data for submission '!L30=\"\",0,'Data for submission '!L30)","v":3},{"$f":"IF('Data for submission '!M30=\"\",0,'Data for submission '!M30)","v":3},{"$f":"IF('Data for submission '!N30=\"\",0,'Data for submission '!N30)","v":4},{"$f":"IF('Data for submission '!O30=\"\",0,'Data for submission '!O30)","v":4},{"$f":"IF('Data for submission '!P30=\"\",0,'Data for submission '!P30)","v":0},{"$f":"IF('Data for submission '!Q30=\"\",0,'Data for submission '!Q30)","v":0},{"$f":"IF(ISBLANK('Data for submission '!R30),\"\",'Data for submission '!R30)","v":""}]
{"$rows_left_out":49}